BDBM176800 US9675612, 37 N-[2-(Dimethylamino)-2-oxoethyl]-N-methyl-7-[(2-oxo-2,3-dihydro-1,3-benzothiazol-6-yl)amino][1,3]thiazolo[5,4-d]pyrimidine-2-carboxamide
SMILES CN(C)C(=O)CN(C)C(=O)c1nc2c(Nc3ccc4[nH]c(=O)sc4c3)ncnc2s1
InChI Key InChIKey=WPRLGOAWHDQXCW-UHFFFAOYSA-N
Data  1 IC50
  Tab Delimited (TSV)   2D SDfile   Computed 3D by Vconf -m prep SDfile
Find this compound or compounds like it in BindingDB:
Activity Spreadsheet -- Enzyme Inhibition Constant Data from BindingDB
Found 1 hit for monomerid = 176800
TargetIsoform 2 of MAP kinase-interacting serine/threonine-protein kinase 1 (MNK1a) 344D](Homo sapiens (Human))
Bayer Pharma Aktiengesellschaft
US Patent
LigandPNGBDBM176800(US9675612, 37 N-[2-(Dimethylamino)-2-oxoethyl]-N-m...)
Affinity DataIC50:  445nMpH: 7.5Assay Description:For the assay 50 nL of a 100 fold concentrated solution of the test compound in DMSO was pipetted into a black low volume 384 well microtiter plate (...
Ligand InfoPC cidPC sid
In DepthDetails US Patent