BDBM177336 US9120749, 702
SMILES CC(=O)c1cnc2ccc(cc2c1Nc1ccc(nc1)N1CCNCC1)-c1cc(Cl)c(O)c(Cl)c1
InChI Key InChIKey=HJWVBOUPUNYJJT-UHFFFAOYSA-N
Data  1 IC50
  Tab Delimited (TSV)   2D SDfile   Computed 3D by Vconf -m prep SDfile
Find this compound or compounds like it in BindingDB:
Activity Spreadsheet -- Enzyme Inhibition Constant Data from BindingDB
Found 1 hit for monomerid = 177336
TargetMaternal embryonic leucine zipper kinase(Homo sapiens (Human))
Oncotherapy Science
US Patent
LigandPNGBDBM177336(US9120749, 702)
Affinity DataIC50:  1.40nMpH: 7.4 T: 2°C. Assay description: MELK activity was determined in the presence or absence of compounds using fluorescein isothiocyanate-labeled (FITC-labeled) histone H3 peptide as a ...
In DepthDetails US Patent