BDBM17744 2,6-dimethylphenyl N-[2-({3,5-dimethoxy-4-[3-(4-methylpiperazin-1-yl)propoxy]phenyl}amino)pyrimidin-4-yl]-N-(2,4-dimethoxyphenyl)carbamate::2-aminopyrimidine carbamate, 43
SMILES COc1ccc(N(C(=O)Oc2c(C)cccc2C)c2ccnc(Nc3cc(OC)c(OCCCN4CCN(C)CC4)c(OC)c3)n2)c(OC)c1
InChI Key InChIKey=VSJXTUFWPAOYLC-UHFFFAOYSA-N
Data  13 IC50
PDB links: 1 PDB ID matches this monomer.
  Tab Delimited (TSV)   2D SDfile   Computed 3D by Vconf -m prep SDfile
Find this compound or compounds like it in BindingDB:
Activity Spreadsheet -- Enzyme Inhibition Constant Data from BindingDB
Found 13 hits for monomerid = 17744
TargetTyrosine-protein kinase Lck(Homo sapiens (Human))
Amgen
LigandPNGBDBM17744(2,6-dimethylphenyl N-[2-({3,5-dimethoxy-4-[3-(4-me...)
Affinity DataIC50:  0.600nMpH: 7.5 T: 2°C. Assay description: The assay involves the phosphorylation of a biotinylated substrate and the detection of this phosphorylation after the addition of a streptavidin-all...
TargetAngiopoietin-1 receptor(Homo sapiens (Human))
Amgen
LigandPNGBDBM17744(2,6-dimethylphenyl N-[2-({3,5-dimethoxy-4-[3-(4-me...)
Affinity DataIC50:  200nMpH: 7.5 T: 2°C. Assay description: The assay involves the phosphorylation of a biotinylated substrate and the detection of this phosphorylation after the addition of a streptavidin-all...
In DepthDetails ArticlePubMed
TargetHepatocyte growth factor receptor(Homo sapiens (Human))
Amgen
LigandPNGBDBM17744(2,6-dimethylphenyl N-[2-({3,5-dimethoxy-4-[3-(4-me...)
Affinity DataIC50:  2.40E+3nMpH: 7.5 T: 2°C. Assay description: The assay involves the phosphorylation of a biotinylated substrate and the detection of this phosphorylation after the addition of a streptavidin-all...
In DepthDetails ArticlePubMed
TargetFibroblast growth factor receptor 1(Homo sapiens (Human))
Amgen
LigandPNGBDBM17744(2,6-dimethylphenyl N-[2-({3,5-dimethoxy-4-[3-(4-me...)
Affinity DataIC50:  110nMpH: 7.5 T: 2°C. Assay description: The assay involves the phosphorylation of a biotinylated substrate and the detection of this phosphorylation after the addition of a streptavidin-all...
In DepthDetails ArticlePubMed
TargetInsulin-like growth factor 1 receptor(Homo sapiens (Human))
Amgen
LigandPNGBDBM17744(2,6-dimethylphenyl N-[2-({3,5-dimethoxy-4-[3-(4-me...)
Affinity DataIC50: >2.50E+4nMpH: 7.5 T: 2°C. Assay description: The assay involves the phosphorylation of a biotinylated substrate and the detection of this phosphorylation after the addition of a streptavidin-all...
In DepthDetails ArticlePubMed
TargetTyrosine-protein kinase ZAP-70(Mus musculus)
Amgen
LigandPNGBDBM17744(2,6-dimethylphenyl N-[2-({3,5-dimethoxy-4-[3-(4-me...)
Affinity DataIC50:  370nMpH: 7.5 T: 2°C. Assay description: The assay involves the phosphorylation of a biotinylated substrate and the detection of this phosphorylation after the addition of a streptavidin-all...
In DepthDetails ArticlePubMed
TargetVascular endothelial growth factor receptor 2(Homo sapiens (Human))
Amgen
LigandPNGBDBM17744(2,6-dimethylphenyl N-[2-({3,5-dimethoxy-4-[3-(4-me...)
Affinity DataIC50:  140nM. Assay description: The assay involves the phosphorylation of a biotinylated substrate and the detection of this phosphorylation after the addition of a streptavidin-all...
In DepthDetails ArticlePubMed
TargetTyrosine-protein kinase BTK(Homo sapiens (Human))
Amgen
LigandPNGBDBM17744(2,6-dimethylphenyl N-[2-({3,5-dimethoxy-4-[3-(4-me...)
Affinity DataIC50:  100nM. Assay description: The assay involves the phosphorylation of a biotinylated substrate and the detection of this phosphorylation after the addition of a streptavidin-all...
In DepthDetails ArticlePubMed
TargetTyrosine-protein kinase JAK2(Homo sapiens (Human))
Amgen
LigandPNGBDBM17744(2,6-dimethylphenyl N-[2-({3,5-dimethoxy-4-[3-(4-me...)
Affinity DataIC50:  240nM. Assay description: The assay involves the phosphorylation of a biotinylated substrate and the detection of this phosphorylation after the addition of a streptavidin-all...
In DepthDetails ArticlePubMed
TargetTyrosine-protein kinase JAK3(Homo sapiens (Human))
Amgen
LigandPNGBDBM17744(2,6-dimethylphenyl N-[2-({3,5-dimethoxy-4-[3-(4-me...)
Affinity DataIC50:  1.20E+3nM. Assay description: The assay involves the phosphorylation of a biotinylated substrate and the detection of this phosphorylation after the addition of a streptavidin-all...
In DepthDetails ArticlePubMed
TargetMitogen-activated protein kinase 14(Homo sapiens (Human))
Amgen
LigandPNGBDBM17744(2,6-dimethylphenyl N-[2-({3,5-dimethoxy-4-[3-(4-me...)
Affinity DataIC50:  530nM. Assay description: The assay involves the phosphorylation of a biotinylated substrate and the detection of this phosphorylation after the addition of a streptavidin-all...
In DepthDetails ArticlePubMed
TargetMitogen-activated protein kinase 10(Homo sapiens (Human))
Amgen
LigandPNGBDBM17744(2,6-dimethylphenyl N-[2-({3,5-dimethoxy-4-[3-(4-me...)
Affinity DataIC50: >5.00E+3nM. Assay description: The assay involves the phosphorylation of a biotinylated substrate and the detection of this phosphorylation after the addition of a streptavidin-all...
In DepthDetails ArticlePubMed
TargetProto-oncogene tyrosine-protein kinase Src(Homo sapiens (Human))
Amgen
LigandPNGBDBM17744(2,6-dimethylphenyl N-[2-({3,5-dimethoxy-4-[3-(4-me...)
Affinity DataIC50:  1nM. Assay description: The assay involves the phosphorylation of a biotinylated substrate and the detection of this phosphorylation after the addition of a streptavidin-all...
In DepthDetails ArticlePubMed