BDBM177655 US9120769, 157::US9663470, 157
SMILES CC(C)(O)c1ccc2C[C@H]3[C@H](CCCN3C(=O)c3ccc4[nH]cnc4c3)c2c1
InChI Key
Data  2 IC50
  Tab Delimited (TSV)   2D SDfile   Computed 3D by Vconf -m prep SDfile
Find this compound or compounds like it in BindingDB:
Activity Spreadsheet -- Enzyme Inhibition Constant Data from BindingDB
Found 2 hits for monomerid = 177655
Target11-beta-hydroxysteroid dehydrogenase 1(Homo sapiens (Human))
Vitae Pharmaceuticals
US Patent
LigandPNGBDBM177655(US9120769, 157 | US9663470, 157)
Affinity DataIC50:  1.16E+3nM. Assay description: In vitro inhibition of 11β-HSD1 by test compounds is determined with HTRF (Homogeneous Time-Resolved Fluorescence) technology (cisbio internatio...
In DepthDetails US Patent
Target11-beta-hydroxysteroid dehydrogenase 1(Homo sapiens (Human))
Vitae Pharmaceuticals
US Patent
LigandPNGBDBM177655(US9120769, 157 | US9663470, 157)
Affinity DataIC50:  1.16E+3nMpH: 6.0Assay Description:n vitro inhibition of 11β-HSD1 by test compounds is determined with HTRF (Homogeneous Time-Resolved Fluorescence) technology (cisbio internation...
In DepthDetails US Patent