BDBM177827 US9120791, Example 46::US9603854, 46
SMILES Cn1ccc2cc(ccc12)N(C(=O)c1cc(-c2cc(Cl)ccc2C(=O)N2Cc3ccccc3C[C@H]2CN2CCCOCC2)n2CCCCc12)c1ccc(O)cc1
InChI Key InChIKey=WKZCDEUYPNNZHY-QNGWXLTQSA-N
Data  2 IC50
  Tab Delimited (TSV)   2D SDfile   Computed 3D by Vconf -m prep SDfile
Find this compound or compounds like it in BindingDB:
Activity Spreadsheet -- Enzyme Inhibition Constant Data from BindingDB
Found 2 hits for monomerid = 177827
TargetApoptosis regulator Bcl-2(Homo sapiens (Human))
Les Laboratoires Servier
US Patent
LigandPNGBDBM177827(US9120791, Example 46 | US9603854, 46)
Affinity DataIC50:  21nM. Assay description: The fluorescence polarisation tests were carried out on microplates (384 wells). The Bcl-2 protein, at a final concentration of 2.50×10−8 M, is...
In DepthDetails US Patent
TargetApoptosis regulator Bcl-2(Mus musculus (Mouse))
Les Laboratoires Servier
US Patent
LigandPNGBDBM177827(US9120791, Example 46 | US9603854, 46)
Affinity DataIC50:  21nMpH: 7.4Assay Description:The fluorescence polarisation tests were carried out on microplates (384 wells). The Bcl-2 protein, at a final concentration of 2.50×10−8 M, is...
In DepthDetails US Patent