BDBM178012 3-((3-(4-oxo-4H-chromen-2-yl)phenoxy)methyl)benzonitrile (15)
SMILES O=c1cc(oc2ccccc12)-c1cccc(OCc2cccc(c2)C#N)c1
InChI Key InChIKey=SYAZCTHALJJBCB-UHFFFAOYSA-N
Data  1 IC50
  Tab Delimited (TSV)   2D SDfile   Computed 3D by Vconf -m prep SDfile
Find this compound or compounds like it in BindingDB:
Activity Spreadsheet -- Enzyme Inhibition Constant Data from BindingDB
Found 1 hit for monomerid = 178012
TargetOligo-1,6-glucosidase IMA1(Saccharomyces cerevisiae S288c (Baker's yeast))
Universiti Teknologi Mara
LigandPNGBDBM178012(3-((3-(4-oxo-4H-chromen-2-yl)phenoxy)methyl)benzon...)
Affinity DataIC50:  3.86E+4nMpH: 6.8Assay Description:The α-glucosidase inhibition assay had been carried out using baker¿s yeast a-glucosidase (EC 3.2.1.20) and p-nitrophenyl-α-D-glucopyranosi...
In DepthDetails ArticlePubMed