BDBM178087 2-(chloromethyl)-3-methyl-1,4-dihydronaphthalene-1,4-dione (5f)
SMILES CC1=C(CCl)C(=O)c2ccccc2C1=O
InChI Key InChIKey=PYQUHGSCPCDFBQ-UHFFFAOYSA-N
Data  1 IC50
  Tab Delimited (TSV)   2D SDfile   Computed 3D by Vconf -m prep SDfile
Find this compound or compounds like it in BindingDB:
Activity Spreadsheet -- Enzyme Inhibition Constant Data from BindingDB
Found 1 hit for monomerid = 178087
TargetAmine oxidase(Homo sapiens (Human))
North-West University
LigandPNGBDBM178087(2-(chloromethyl)-3-methyl-1,4-dihydronaphthalene-1...)
Affinity DataIC50:  1.08E+4nM. Assay description: The protocol for measuring IC50 values for the inhibition of MAO-A and MAO-B has been reported in detail in a recent publication (26). The recombinan...
In DepthDetails ArticlePubMed