BDBM178147 US10307413, Compound 193::US10391089, Compound 193::US10980794, Cmpd No 232::US9675614, 193
SMILES O[C@@H](CNC(=O)c1cc(NC2CCOCC2)ncn1)CN1CCc2ccccc2C1
InChI Key InChIKey=CHBAKHGEELJRJT-IBGZPJMESA-N
Data  5 IC50
  Tab Delimited (TSV)   2D SDfile   Computed 3D by Vconf -m prep SDfile
Find this compound or compounds like it in BindingDB:
Activity Spreadsheet -- Enzyme Inhibition Constant Data from BindingDB
Found 5 hits for monomerid = 178147
TargetProtein arginine N-methyltransferase 5(Homo sapiens (Human))
Epizyme
US Patent
LigandPNGBDBM178147(US10307413, Compound 193 | US10391089, Compound 19...)
Affinity DataIC50: <100nM. Assay description: The assays were all performed in a buffer consisting of 20 mM Bicine (pH=7.6), 1 mM TCEP, 0.005% BSG, and 0.002% Tween20, prepared on the day of use....
Ligand InfoPC cidPC sid
In DepthDetails US Patent
TargetProtein arginine N-methyltransferase 5(Homo sapiens (Human))
Epizyme
US Patent
LigandPNGBDBM178147(US10307413, Compound 193 | US10391089, Compound 19...)
Affinity DataIC50: <100nM. Assay description: The assays were all performed in a buffer consisting of 20 mM Bicine (pH=7.6), 1 mM TCEP, 0.005% BSG, and 0.002% Tween20, prepared on the day of use....
Ligand InfoPC cidPC sid
In DepthDetails US Patent
TargetProtein arginine N-methyltransferase 5(Homo sapiens (Human))
Epizyme
US Patent
LigandPNGBDBM178147(US10307413, Compound 193 | US10391089, Compound 19...)
Affinity DataIC50:  550nM. Assay description: The assays were all performed in a buffer consisting of 20 mM Bicine (pH=7.6), 1 mM TCEP, 0.005% BSG, and 0.002% Tween20, prepared on the day of use....
Ligand InfoPC cidPC sid
In DepthDetails US Patent
TargetProtein arginine N-methyltransferase 5(Homo sapiens (Human))
Epizyme
US Patent
LigandPNGBDBM178147(US10307413, Compound 193 | US10391089, Compound 19...)
Affinity DataIC50: <100nM. Assay description: The assays were all performed in a buffer consisting of 20 mM Bicine (pH=7.6), 1 mM TCEP, 0.005% BSG, and 0.002% Tween20, prepared on the day of use....
Ligand InfoPC cidPC sid
In DepthDetails US Patent
TargetMethylosome protein 50/Protein arginine N-methyltransferase 5(Homo sapiens (Human))
Epizyme
US Patent
LigandPNGBDBM178147(US10307413, Compound 193 | US10391089, Compound 19...)
Affinity DataIC50: <100nM. Assay description: The assays were all performed in a buffer consisting of 20 mM Bicine (pH=7.6), 1 mM TCEP, 0.005% BSG, and 0.002% Tween20, prepared on the day of use....
Ligand InfoPC cidPC sid
In DepthDetails US Patent