BDBM178403 US9120812, 188
SMILES COCCN1CC(C)(C)Oc2nc(nc(-c3ccc(NC(=O)Nc4ccc(F)cc4F)cc3)c2C1=O)N1CCOC[C@@H]1C
InChI Key InChIKey=TYODHKNGHJRSFC-SFHVURJKSA-N
Data  2 IC50
  Tab Delimited (TSV)   2D SDfile   Computed 3D by Vconf -m prep SDfile
Find this compound or compounds like it in BindingDB:
Activity Spreadsheet -- Enzyme Inhibition Constant Data from BindingDB
Found 2 hits for monomerid = 178403
TargetPhosphatidylinositol 3-kinase regulatory subunit alpha(Homo sapiens (Human))
Sanofi
US Patent
LigandPNGBDBM178403(US9120812, 188)
Affinity DataIC50:  2.33E+3nMpH: 7.5Assay Description:The test uses a lucifeurerin/luciferase system to measure the concentration of ATP and its consumption during the enzymatic reaction. The test is per...
In DepthDetails US Patent
TargetSerine/threonine-protein kinase mTOR(Homo sapiens (Human))
Sanofi
US Patent
LigandPNGBDBM178403(US9120812, 188)
Affinity DataIC50:  63nMpH: 7.5 T: 2°C. Assay description: The test detects the phosphorylation of the substrate GFP-4EBP1 using a terbium-labelled antibody that is specific for the phospho-Thr46 epitope. Bin...
In DepthDetails US Patent