BDBM178435 US9120812, 220
SMILES COCCN1CC(C)(C)Oc2nc(nc(-c3ccc(NC(=O)Nc4cccc(OC(C)F)c4)c(F)c3)c2C1=O)N1CC2CCC(C1)O2
InChI Key InChIKey=PDMJTKIMKQIYQM-UHFFFAOYSA-N
Data  2 IC50
  Tab Delimited (TSV)   2D SDfile   Computed 3D by Vconf -m prep SDfile
Find this compound or compounds like it in BindingDB:
Activity Spreadsheet -- Enzyme Inhibition Constant Data from BindingDB
Found 2 hits for monomerid = 178435
TargetSerine/threonine-protein kinase mTOR(Homo sapiens (Human))
Sanofi
US Patent
LigandPNGBDBM178435(US9120812, 220)
Affinity DataIC50:  348nMpH: 7.5 T: 2°C. Assay description: The test detects the phosphorylation of the substrate GFP-4EBP1 using a terbium-labelled antibody that is specific for the phospho-Thr46 epitope. Bin...
In DepthDetails US Patent
TargetPhosphatidylinositol 3-kinase regulatory subunit alpha(Homo sapiens (Human))
Sanofi
US Patent
LigandPNGBDBM178435(US9120812, 220)
Affinity DataIC50:  1.86E+3nMpH: 7.5Assay Description:The test uses a lucifeurerin/luciferase system to measure the concentration of ATP and its consumption during the enzymatic reaction. The test is per...
In DepthDetails US Patent