BDBM178634 US9125913, 199
SMILES CN(C)CCOc1cccc(c1CN1CCN(CC1)c1ccc(C(=O)NS(=O)(=O)c2ccc(NC3CCN(CC3)C3CCOCC3)c(c2)[N+]([O-])=O)c(Oc2cccc3[nH]ccc23)c1)-c1ccc(Cl)cc1
InChI Key InChIKey=MFQKRPNAEIVIFU-UHFFFAOYSA-N
Data  2 KI
  Tab Delimited (TSV)   2D SDfile   Computed 3D by Vconf -m prep SDfile
Find this compound or compounds like it in BindingDB:
Activity Spreadsheet -- Enzyme Inhibition Constant Data from BindingDB
Found 2 hits for monomerid = 178634
TargetApoptosis regulator Bcl-2(Mus musculus (Mouse))
Abbvie
US Patent
LigandPNGBDBM178634(US9125913, 199)
Affinity DataKi:  0.0140nM. Assay description: The inhibition constant (Ki) is the dissociation constant of an enzyme-inhibitor complex or a protein/small molecule complex, wherein the small molec...
In DepthDetails US Patent
TargetBcl-2-like protein 1(Mus musculus (Mouse))
Abbvie
US Patent
LigandPNGBDBM178634(US9125913, 199)
Affinity DataKi:  5.23nM. Assay description: The inhibition constant (Ki) is the dissociation constant of an enzyme-inhibitor complex or a protein/small molecule complex, wherein the small molec...
In DepthDetails US Patent