BDBM17906 4-{[(2S,4S)-1-[2-(3-ethyl-4-{[(2-methylphenyl)carbamoyl]amino}phenyl)acetyl]-4-fluoropyrrolidin-2-yl]methoxy}benzoic acid::benzoic acid derivative, 12i
SMILES CCc1cc(CC(=O)N2C[C@@H](F)C[C@H]2COc2ccc(cc2)C(O)=O)ccc1NC(=O)Nc1ccccc1C
InChI Key InChIKey=XWUZBYZNZYQJKF-ZEQRLZLVSA-N
Data  1 IC50
  Tab Delimited (TSV)   2D SDfile   Computed 3D by Vconf -m prep SDfile
Find this compound or compounds like it in BindingDB:
Activity Spreadsheet -- Enzyme Inhibition Constant Data from BindingDB
Found 1 hit for monomerid = 17906
TargetIntegrin alpha-4/beta-1 [T112H](Homo sapiens (Human))
Daiichi Pharmaceutical
LigandPNGBDBM17906(4-{[(2S,4S)-1-[2-(3-ethyl-4-{[(2-methylphenyl)carb...)
Affinity DataIC50:  15nMpH: 7.5 T: 2°C. Assay description: The 4B4 cells expressing VLA-4 were distributed into each well of a 96-well culture plate for 2 days. Compound and Eu-labeled Human VCAM-1/Fc Chimera...
In DepthDetails ArticlePubMed