BDBM179083 US9126931, 882
SMILES CC1(C)c2[nH]c3cc(ccc3c2C(=O)c2cnc(cc12)N1CCC(CC1)N1CCCCC1)C#N
InChI Key InChIKey=YIEMGHPISIKJBA-UHFFFAOYSA-N
Data  1 IC50
  Tab Delimited (TSV)   2D SDfile   Computed 3D by Vconf -m prep SDfile
Find this compound or compounds like it in BindingDB:
Activity Spreadsheet -- Enzyme Inhibition Constant Data from BindingDB
Found 1 hit for monomerid = 179083
TargetALK tyrosine kinase receptor(Homo sapiens (Human))
Chugai Seiyaku Kabushiki Kaisha
US Patent
LigandPNGBDBM179083(US9126931, 882)
Affinity DataIC50:  0.494nM. Assay description: ALK-inhibiting activity was measured by following an activity of inhibiting phosphorylation by biotinylated peptide (EGPWLEEEEEAYGWMDF). For the dete...
In DepthDetails US Patent