BDBM179171 US9126941, RD90
SMILES CN=C1N(C(=S)N(c2ccc(C)cc2)C11CCC1)c1ccc([N+]#[C-])c(c1)C(F)(F)F
InChI Key InChIKey=RMTWUJGVVLZZCL-ZXVVBBHZSA-N
Data  1 IC50
  Tab Delimited (TSV)   2D SDfile   Computed 3D by Vconf -m prep SDfile
Find this compound or compounds like it in BindingDB:
Activity Spreadsheet -- Enzyme Inhibition Constant Data from BindingDB
Found 1 hit for monomerid = 179171
TargetAndrogen receptor(Homo sapiens (Human))
The Regents Of The University Of California
US Patent
LigandPNGBDBM179171(US9126941, RD90)
Affinity DataIC50:  222nM. Assay description: The compounds were subjected to tests using an artificial AR response reporter system in a hormone refractory prostate cancer cell line. In this syst...
In DepthDetails US Patent