BDBM17933 2-(4-{[(2S)-4,4-difluoro-1-[2-(3-methoxy-4-{[(2-methylphenyl)carbamoyl]amino}phenyl)acetyl]pyrrolidin-2-yl]carbonyl}piperazin-1-yl)acetic acid::Piperazinylacetic acid derivative, 11j
SMILES COc1cc(CC(=O)N2CC(F)(F)C[C@H]2C(=O)N2CCN(CC(O)=O)CC2)ccc1NC(=O)Nc1ccccc1C
InChI Key InChIKey=RUTOQXFHSANWNZ-QFIPXVFZSA-N
Data  1 IC50
  Tab Delimited (TSV)   2D SDfile   Computed 3D by Vconf -m prep SDfile
Find this compound or compounds like it in BindingDB:
Activity Spreadsheet -- Enzyme Inhibition Constant Data from BindingDB
Found 1 hit for monomerid = 17933
TargetIntegrin alpha-4/beta-1 [T112H](Homo sapiens (Human))
Daiichi Pharmaceutical
LigandPNGBDBM17933(2-(4-{[(2S)-4,4-difluoro-1-[2-(3-methoxy-4-{[(2-me...)
Affinity DataIC50:  1.40nMpH: 7.5 T: 2°C. Assay description: The 4B4 cells expressing VLA-4 were distributed into each well of a 96-well culture plate for 2 days. Compound and Eu-labeled Human VCAM-1/Fc Chimera...
In DepthDetails ArticlePubMed