BDBM179679 US9127001, 6bh::US9598410, Compound 6bh
SMILES COc1ccc(F)c(c1)-c1nn(Cc2ccc(F)cc2F)c2CCN(Cc12)C(C)=O
InChI Key InChIKey=ODGYEKHQCHJDKO-UHFFFAOYSA-N
Data  2 IC50
  Tab Delimited (TSV)   2D SDfile   Computed 3D by Vconf -m prep SDfile
Find this compound or compounds like it in BindingDB:
Activity Spreadsheet -- Enzyme Inhibition Constant Data from BindingDB
Found 2 hits for monomerid = 179679
TargetPotassium channel subfamily K member 3(Homo sapiens (Human))
Sanofi
US Patent
LigandPNGBDBM179679(US9127001, 6bh | US9598410, Compound 6bh)
Affinity DataIC50: <1.00E+4nM. Assay description: Human TASK-1 channels were expressed in Xenopus oocytes. For this purpose, oocytes were isolated from Xenopus laevis and defoliated. Subsequently, TA...
In DepthDetails US Patent
TargetPotassium channel subfamily K member 3(Homo sapiens (Human))
Sanofi
US Patent
LigandPNGBDBM179679(US9127001, 6bh | US9598410, Compound 6bh)
Affinity DataIC50: <1.00E+4nMT: 2°C. Assay description: Human TASK-1 channels were expressed in Xenopus oocytes. For this purpose, oocytes were isolated from Xenopus laevis and defoliculated. Subsequently,...
In DepthDetails US Patent