BDBM179706 US9127001, 8m::US9598410, Compound 8m
SMILES Fc1ccc(Cn2nc(c3CN(CCc23)C(=O)C2CCOC2)-c2cccc(c2)C#N)c(F)c1
InChI Key InChIKey=HUFBPECTFKXABN-UHFFFAOYSA-N
Data  2 IC50
  Tab Delimited (TSV)   2D SDfile   Computed 3D by Vconf -m prep SDfile
Find this compound or compounds like it in BindingDB:
Activity Spreadsheet -- Enzyme Inhibition Constant Data from BindingDB
Found 2 hits for monomerid = 179706
TargetPotassium channel subfamily K member 3(Homo sapiens (Human))
Sanofi
US Patent
LigandPNGBDBM179706(US9127001, 8m | US9598410, Compound 8m)
Affinity DataIC50:  890nM. Assay description: Human TASK-1 channels were expressed in Xenopus oocytes. For this purpose, oocytes were isolated from Xenopus laevis and defoliated. Subsequently, TA...
In DepthDetails US Patent
TargetPotassium channel subfamily K member 3(Homo sapiens (Human))
Sanofi
US Patent
LigandPNGBDBM179706(US9127001, 8m | US9598410, Compound 8m)
Affinity DataIC50:  890nMT: 2°C. Assay description: Human TASK-1 channels were expressed in Xenopus oocytes. For this purpose, oocytes were isolated from Xenopus laevis and defoliculated. Subsequently,...
In DepthDetails US Patent