BDBM179731 US9127001, 13b::US9598410, Compound 13b
SMILES CC(=O)N1CCc2c(C1)c(nn2Cc1ccc(F)cc1F)-c1cccc(n1)C#N
InChI Key InChIKey=USRVPCUKKCCDKS-UHFFFAOYSA-N
Data  2 IC50
  Tab Delimited (TSV)   2D SDfile   Computed 3D by Vconf -m prep SDfile
Find this compound or compounds like it in BindingDB:
Activity Spreadsheet -- Enzyme Inhibition Constant Data from BindingDB
Found 2 hits for monomerid = 179731
TargetPotassium channel subfamily K member 3(Homo sapiens (Human))
Sanofi
US Patent
LigandPNGBDBM179731(US9127001, 13b | US9598410, Compound 13b)
Affinity DataIC50:  462nM. Assay description: Human TASK-1 channels were expressed in Xenopus oocytes. For this purpose, oocytes were isolated from Xenopus laevis and defoliated. Subsequently, TA...
In DepthDetails US Patent
TargetPotassium channel subfamily K member 3(Homo sapiens (Human))
Sanofi
US Patent
LigandPNGBDBM179731(US9127001, 13b | US9598410, Compound 13b)
Affinity DataIC50:  462nMT: 2°C. Assay description: Human TASK-1 channels were expressed in Xenopus oocytes. For this purpose, oocytes were isolated from Xenopus laevis and defoliculated. Subsequently,...
In DepthDetails US Patent