BDBM179788 1-(3-Phenylpropyl)-4-(((6-methoxycoumarin-7-yl)oxy)methyl)pyridinium bromide (6f)
SMILES COc1cc2ccc(=O)oc2cc1OCc1cc[n+](CCCc2ccccc2)cc1
InChI Key InChIKey=WQKHGIZULCMIPC-UHFFFAOYSA-N
Data  1 IC50
  Tab Delimited (TSV)   2D SDfile   Computed 3D by Vconf -m prep SDfile
Find this compound or compounds like it in BindingDB:
Activity Spreadsheet -- Enzyme Inhibition Constant Data from BindingDB
Found 1 hit for monomerid = 179788
TargetAcetylcholinesterase(Electrophorus electricus (Electric eel))
Chulabhorn Research Institute
LigandPNGBDBM179788(1-(3-Phenylpropyl)-4-(((6-methoxycoumarin-7-yl)oxy...)
Affinity DataIC50:  1.02E+3nMpH: 8.0Assay Description:AChE inhibitory activity was measured with a Molecular Devices Spectra Max Plus 384 spectrophotometer (CA, USA) based on Ellman's method with sli...
In DepthDetails ArticlePubMed