BDBM179793 1-(2-Fluorobenzyl)-4-(((6-methoxycoumarin-7-yl)oxy)methyl)pyridinium bromide (6k)
SMILES COc1cc2ccc(=O)oc2cc1OCc1cc[n+](Cc2ccccc2F)cc1
InChI Key InChIKey=ZEGYBRXCGSRZLS-UHFFFAOYSA-N
Data  1 IC50
  Tab Delimited (TSV)   2D SDfile   Computed 3D by Vconf -m prep SDfile
Find this compound or compounds like it in BindingDB:
Activity Spreadsheet -- Enzyme Inhibition Constant Data from BindingDB
Found 1 hit for monomerid = 179793
TargetAcetylcholinesterase(Electrophorus electricus (Electric eel))
Chulabhorn Research Institute
LigandPNGBDBM179793(1-(2-Fluorobenzyl)-4-(((6-methoxycoumarin-7-yl)oxy...)
Affinity DataIC50:  215nMpH: 8.0Assay Description:AChE inhibitory activity was measured with a Molecular Devices Spectra Max Plus 384 spectrophotometer (CA, USA) based on Ellman's method with sli...
In DepthDetails ArticlePubMed