BDBM17984 1,4-benzoxazin-3-one, 21::N-{2-[6-(2,4-diamino-6-ethylpyrimidin-5-yl)-2-methyl-3-oxo-2-(trifluoromethyl)-3,4-dihydro-2H-1,4-benzoxazin-4-yl]ethyl}acetamide
SMILES CCc1nc(N)nc(N)c1-c1ccc2OC(C)(C(=O)N(CCNC(C)=O)c2c1)C(F)(F)F
InChI Key InChIKey=XHILZVTVIKVPKW-UHFFFAOYSA-N
Data  1 IC50
  Tab Delimited (TSV)   2D SDfile   Computed 3D by Vconf -m prep SDfile
Find this compound or compounds like it in BindingDB:
Activity Spreadsheet -- Enzyme Inhibition Constant Data from BindingDB
Found 1 hit for monomerid = 17984
TargetRenin(Homo sapiens (Human))
Pfizer
LigandPNGBDBM17984(1,4-benzoxazin-3-one, 21 | N-{2-[6-(2,4-diamino-6-...)
Affinity DataIC50:  17nMpH: 7.4 T: 2°C. Assay description: The renin assay utilized a tandem Green Flourescent Protein (tGFP) substrate that was hydrolyzed by human rennin. The tGFP substrate contained a nine...
In DepthDetails ArticlePubMed