BDBM18005 1,4-benzoxazin-3-one, 42::methyl N-{2-[6-(2,4-diamino-6-ethylpyrimidin-5-yl)-2-(3,5-difluorophenyl)-2-methyl-3-oxo-3,4-dihydro-2H-1,4-benzoxazin-4-yl]ethyl}carbamate
SMILES CCc1nc(N)nc(N)c1-c1ccc2OC(C)(C(=O)N(CCNC(=O)OC)c2c1)c1cc(F)cc(F)c1
InChI Key InChIKey=MNEZWRIUOPOINT-UHFFFAOYSA-N
Data  1 IC50
  Tab Delimited (TSV)   2D SDfile   Computed 3D by Vconf -m prep SDfile
Find this compound or compounds like it in BindingDB:
Activity Spreadsheet -- Enzyme Inhibition Constant Data from BindingDB
Found 1 hit for monomerid = 18005
TargetRenin(Homo sapiens (Human))
Pfizer
LigandPNGBDBM18005(1,4-benzoxazin-3-one, 42 | methyl N-{2-[6-(2,4-dia...)
Affinity DataIC50:  2nM. Assay description: The renin assay utilized a tandem Green Flourescent Protein (tGFP) substrate that was hydrolyzed by human rennin. The tGFP substrate contained a nine...
In DepthDetails ArticlePubMed