BDBM180128 US9676721, 83 2-cyano-1-{[4-(2,6-dimethoxypyridine-3-sulfonyl)phenyl]methyl}-3-(pyridin-4-yl)guanidine
SMILES COc1ccc(c(OC)n1)S(=O)(=O)c1ccc(CNC(Nc2ccncc2)=NC#N)cc1
InChI Key InChIKey=USBKDDPRUUWXQN-UHFFFAOYSA-N
Data  1 IC50
  Tab Delimited (TSV)   2D SDfile   Computed 3D by Vconf -m prep SDfile
Find this compound or compounds like it in BindingDB:
Activity Spreadsheet -- Enzyme Inhibition Constant Data from BindingDB
Found 1 hit for monomerid = 180128
TargetNicotinamide phosphoribosyltransferase(Homo sapiens (Human))
Forma Tm
US Patent
LigandPNGBDBM180128(US9676721, 83 2-cyano-1-{[4-(2,6-dimethoxypyridine...)
Affinity DataIC50:  6.80nMpH: 7.5 T: 2°C. Assay description: The NAMPT enzymatic reactions were carried out in Buffer A (50 mM Hepes pH 7.5, 50 mM NaCl, 5 mM MgCl2, and 1 mM THP) in 96-well V-bottom plates. The...
Ligand InfoPC cidPC sid
In DepthDetails US Patent