BDBM180259 US9676721, 10 1-({4-[(4-chloro-2-methoxybenzene)sulfonyl]phenyl}methyl)-2-cyano-3-(pyridin-4-yl)guanidine
SMILES COc1cc(Cl)ccc1S(=O)(=O)c1ccc(CNC(Nc2ccncc2)=NC#N)cc1
InChI Key InChIKey=DOZCGGJIRXRTOB-UHFFFAOYSA-N
Data  1 IC50
  Tab Delimited (TSV)   2D SDfile   Computed 3D by Vconf -m prep SDfile
Find this compound or compounds like it in BindingDB:
Activity Spreadsheet -- Enzyme Inhibition Constant Data from BindingDB
Found 1 hit for monomerid = 180259
TargetNicotinamide phosphoribosyltransferase(Homo sapiens (Human))
Forma Tm
US Patent
LigandPNGBDBM180259(US9676721, 10 1-({4-[(4-chloro-2-methoxybenzene)su...)
Affinity DataIC50:  3nMpH: 7.5 T: 2°C. Assay description: The NAMPT enzymatic reactions were carried out in Buffer A (50 mM Hepes pH 7.5, 50 mM NaCl, 5 mM MgCl2, and 1 mM THP) in 96-well V-bottom plates. The...
Ligand InfoPC cidPC sid
In DepthDetails US Patent