BDBM180260 US9676721, 4 1-({4-[(3-chloro-4-methylbenzene)sulfonyl]phenyl}methyl)-2-cyano-3-(pyridin-4-yl)guanidine
SMILES Cc1ccc(cc1Cl)S(=O)(=O)c1ccc(CNC(Nc2ccncc2)=NC#N)cc1
InChI Key InChIKey=DXNGDMLUFGWNHY-UHFFFAOYSA-N
Data  1 IC50
  Tab Delimited (TSV)   2D SDfile   Computed 3D by Vconf -m prep SDfile
Find this compound or compounds like it in BindingDB:
Activity Spreadsheet -- Enzyme Inhibition Constant Data from BindingDB
Found 1 hit for monomerid = 180260
TargetNicotinamide phosphoribosyltransferase(Homo sapiens (Human))
Forma Tm
US Patent
LigandPNGBDBM180260(US9676721, 4 1-({4-[(3-chloro-4-methylbenzene)sulf...)
Affinity DataIC50:  1.90nMpH: 7.5 T: 2°C. Assay description: The NAMPT enzymatic reactions were carried out in Buffer A (50 mM Hepes pH 7.5, 50 mM NaCl, 5 mM MgCl2, and 1 mM THP) in 96-well V-bottom plates. The...
Ligand InfoPC cidPC sid
In DepthDetails US Patent