BDBM180277 US9676721, 51 2-cyano-1-({4-[(4-methoxy-3-methylbenzene)sulfonyl]phenyl}methyl)-3-(pyridin-4-yl)guanidine
SMILES COc1ccc(cc1C)S(=O)(=O)c1ccc(CN\C(Nc2ccncc2)=N/C#N)cc1
InChI Key InChIKey=PJRDSNBEZAVPIQ-UHFFFAOYSA-N
Data  1 IC50
  Tab Delimited (TSV)   2D SDfile   Computed 3D by Vconf -m prep SDfile
Find this compound or compounds like it in BindingDB:
Activity Spreadsheet -- Enzyme Inhibition Constant Data from BindingDB
Found 1 hit for monomerid = 180277
TargetNicotinamide phosphoribosyltransferase(Homo sapiens (Human))
Forma Tm
US Patent
LigandPNGBDBM180277(US9676721, 51 2-cyano-1-({4-[(4-methoxy-3-methylbe...)
Affinity DataIC50:  20nMpH: 7.5 T: 2°C. Assay description: The NAMPT enzymatic reactions were carried out in Buffer A (50 mM Hepes pH 7.5, 50 mM NaCl, 5 mM MgCl2, and 1 mM THP) in 96-well V-bottom plates. The...
Ligand InfoPC cidPC sid
In DepthDetails US Patent