BDBM180362 US9133168, Example 17c::US9133168, Example 18c
SMILES CC1Cc2c(ccc(F)c2F)N1C(=O)Cc1nc(cc(=O)[nH]1)N1CCOCC1
InChI Key
Data  2 IC50
  Tab Delimited (TSV)   2D SDfile   Computed 3D by Vconf -m prep SDfile
Find this compound or compounds like it in BindingDB:
Activity Spreadsheet -- Enzyme Inhibition Constant Data from BindingDB
Found 2 hits for monomerid = 180362
TargetRAC-alpha serine/threonine-protein kinase(Homo sapiens (Human))
Sanofi
US Patent
LigandPNGBDBM180362(US9133168, Example 17c | US9133168, Example 18c)
Affinity DataIC50:  1nM. Assay description: This test is based on measurement of the expression of AKT protein phosphorylated on serine 473 (P-AKT-S473) in the PC3 human prostate carcinoma line...
In DepthDetails US Patent
TargetRAC-alpha serine/threonine-protein kinase(Homo sapiens (Human))
Sanofi
US Patent
LigandPNGBDBM180362(US9133168, Example 17c | US9133168, Example 18c)
Affinity DataIC50:  4nM. Assay description: This test is based on measurement of the expression of AKT protein phosphorylated on serine 473 (P-AKT-S473) in the PC3 human prostate carcinoma line...
In DepthDetails US Patent