BDBM18056 3-({[(3,4-dichlorophenyl)methyl]sulfanyl}methanimidoyl)guanidine::amidinothiouronium, 11
SMILES NC(=N)NC(=N)SCc1ccc(Cl)c(Cl)c1
InChI Key InChIKey=XDCFNSWEVCXSFO-UHFFFAOYSA-N
Data  1 IC50
  Tab Delimited (TSV)   2D SDfile   Computed 3D by Vconf -m prep SDfile
Find this compound or compounds like it in BindingDB:
Activity Spreadsheet -- Enzyme Inhibition Constant Data from BindingDB
Found 1 hit for monomerid = 18056
TargetDihydrofolate reductase(Escherichia coli)
University Of Prince Edward Island
LigandPNGBDBM18056(3-({[(3,4-dichlorophenyl)methyl]sulfanyl}methanimi...)
Affinity DataIC50:  3.70E+3nMpH: 7.0 T: 2°C. Assay description: The DHFR inhibition observed with each derivative was characterized by determination and comparison of the IC50 values. IC50 determinations were perf...
In DepthDetails ArticlePubMed