BDBM18089 1-(4-bromothiophen-2-yl)-2-{[(2-methoxyphenyl)methyl]amino}ethan-1-ol::ethanolamine, 34
SMILES COc1ccccc1CNCC(O)c1cc(Br)cs1
InChI Key InChIKey=XGIUJJDVZVAUJA-UHFFFAOYSA-N
Data  1 IC50
  Tab Delimited (TSV)   2D SDfile   Computed 3D by Vconf -m prep SDfile
Find this compound or compounds like it in BindingDB:
Activity Spreadsheet -- Enzyme Inhibition Constant Data from BindingDB
Found 1 hit for monomerid = 18089
TargetPhenylalanine--tRNA ligase alpha/beta subunit(Staphylococcus aureus)
Gsk
LigandPNGBDBM18089(1-(4-bromothiophen-2-yl)-2-{[(2-methoxyphenyl)meth...)
Affinity DataIC50:  50nMpH: 7.9 T: 2°C. Assay description: The reactions were performed in 96-well Packard 384-well Packard Optiplates. After 10 min of incubation, the reaction was stopped by addition of a co...
In DepthDetails ArticlePubMed