BDBM181148 US9138423, 2,4-dimethyl-1H-pyrrole
SMILES Cc1c[nH]c(C)c1
InChI Key InChIKey=MFFMQGGZCLEMCI-UHFFFAOYSA-N
Data  1 KI
  Tab Delimited (TSV)   2D SDfile   Computed 3D by Vconf -m prep SDfile
Find this compound or compounds like it in BindingDB:
Activity Spreadsheet -- Enzyme Inhibition Constant Data from BindingDB
Found 1 hit for monomerid = 181148
TargetPorphobilinogen deaminase(Homo sapiens (Human))
AsociacióN Centro De InvestigacióN Cooperativa En Biociencias—Cic Biogune
US Patent
LigandPNGBDBM181148(US9138423, 2,4-dimethyl-1H-pyrrole)
Affinity DataKi:  6.00E+3nM ΔG°:  -7.41kcal/molepH: 8.0 T: 2°C. Assay description: The assay is based on the method described by Jordan (Shoolingin-Jordan P M et al. (1997). Methods in enzymology 281: 327-336) with some modification...
In DepthDetails US Patent