BDBM181162 US9139529, 5::US9783501, Compound 5
SMILES NS(=O)(=O)c1cccc(NC(=O)c2nc3ccccc3nc2Oc2ccc(F)cc2F)c1
InChI Key InChIKey=JPNNYEVGDPYVAC-UHFFFAOYSA-N
Data  2 IC50
  Tab Delimited (TSV)   2D SDfile   Computed 3D by Vconf -m prep SDfile
Find this compound or compounds like it in BindingDB:
Activity Spreadsheet -- Enzyme Inhibition Constant Data from BindingDB
Found 2 hits for monomerid = 181162
TargetSodium channel protein type 10 subunit alpha(Homo sapiens (Human))
Vertex Pharmaceuticals
US Patent
LigandPNGBDBM181162(US9139529, 5 | US9783501, Compound 5)
Affinity DataIC50:  13nM. Assay description: Patch clamp electrophysiology was used to assess the efficacy and selectivity of sodium channel blockers in dorsal root ganglion neurons. Rat neurons...
In DepthDetails US Patent
TargetSodium channel protein type 10 subunit alpha(Rattus norvegicus (Rat))
Vertex Pharmaceuticals
US Patent
LigandPNGBDBM181162(US9139529, 5 | US9783501, Compound 5)
Affinity DataIC50:  13nM. Assay description: Patch clamp electrophysiology was used to assess the efficacy and selectivity of sodium channel blockers in dorsal root ganglion neurons. Rat neurons...
In DepthDetails US Patent