BDBM181393 US9139577, 2.001::US9708274, 2.001
SMILES CC(Oc1cc(F)ccc1Nc1ncnc2cc(cc(C)c12)N=S1(=O)CCCC1)C(C)(C)O
InChI Key InChIKey=ZJBOENMAUCUUIV-UHFFFAOYSA-N
Data  4 IC50
  Tab Delimited (TSV)   2D SDfile   Computed 3D by Vconf -m prep SDfile
Find this compound or compounds like it in BindingDB:
Activity Spreadsheet -- Enzyme Inhibition Constant Data from BindingDB
Found 4 hits for monomerid = 181393
TargetMAP kinase-interacting serine/threonine-protein kinase 2(Homo sapiens (Human))
Boehringer Ingelheim International
US Patent
LigandPNGBDBM181393(US9139577, 2.001 | US9708274, 2.001)
Affinity DataIC50:  5nM. Assay description: The inhibition of kinase activity of MNK2a was assessed using pre-activated GST-MNK2a. The white, 384-well OptiPlate F plates were purchased from Per...
In DepthDetails US Patent
TargetMAP kinase-interacting serine/threonine-protein kinase 1(Homo sapiens (Human))
Evotec International
US Patent
LigandPNGBDBM181393(US9139577, 2.001 | US9708274, 2.001)
Affinity DataIC50:  228nMpH: 7.5Assay Description:The inhibition of kinase activity of MNK1a was assessed using pre-activated GST-MNK1a. The 2xMKNK1 (MNK1) mixture is prepared in 50 mM HEPES pH 7.5, ...
In DepthDetails US Patent
TargetMAP kinase-interacting serine/threonine-protein kinase 2(Homo sapiens (Human))
Boehringer Ingelheim International
US Patent
LigandPNGBDBM181393(US9139577, 2.001 | US9708274, 2.001)
Affinity DataIC50:  5nMT: 2°C. Assay description: The inhibition of kinase activity of MNK2a was assessed using pre-activated GST-MNK2a. The white, 384-well OptiPlate F plates were purchased from Per...
In DepthDetails US Patent
TargetMAP kinase-interacting serine/threonine-protein kinase 1(Homo sapiens (Human))
Evotec International
US Patent
LigandPNGBDBM181393(US9139577, 2.001 | US9708274, 2.001)
Affinity DataIC50:  228nM. Assay description: The Z-LYTE biochemical assay employs a fluorescence-based, coupled-enzyme format and is based on the differential sensitivity of phosphorylated and n...
In DepthDetails US Patent