BDBM181624 US9139577, 4.130::US9708274, 4.130
SMILES CC(NC(=O)[C@@H](C)Oc1cc(F)ccc1Nc1ncnc2cc(cc(F)c12)N=S1(=O)CCC1)C(F)F
InChI Key InChIKey=FGEQLCDRZXGPPU-ZGTCLIOFSA-N
Data  2 IC50
  Tab Delimited (TSV)   2D SDfile   Computed 3D by Vconf -m prep SDfile
Find this compound or compounds like it in BindingDB:
Activity Spreadsheet -- Enzyme Inhibition Constant Data from BindingDB
Found 2 hits for monomerid = 181624
TargetMAP kinase-interacting serine/threonine-protein kinase 2(Homo sapiens (Human))
Evotec International
US Patent
LigandPNGBDBM181624(US9139577, 4.130 | US9708274, 4.130)
Affinity DataIC50:  3nMT: 2°C. Assay description: The inhibition of kinase activity of MNK2a was assessed using pre-activated GST-MNK2a. The white, 384-well OptiPlate F plates were purchased from Per...
In DepthDetails US Patent
TargetMAP kinase-interacting serine/threonine-protein kinase 2(Homo sapiens (Human))
Evotec International
US Patent
LigandPNGBDBM181624(US9139577, 4.130 | US9708274, 4.130)
Affinity DataIC50:  3nM. Assay description: The inhibition of kinase activity of MNK2a was assessed using pre-activated GST-MNK2a. The white, 384-well OptiPlate F plates were purchased from Per...
In DepthDetails US Patent