BDBM182064 US9145391, 1-32
SMILES Cc1cc(Nc2cc(ccn2)C2CC2)nc(c1)-c1ccc(nc1)C(C)(O)C1CCC(CC1)C(O)=O
InChI Key InChIKey=LEBMIYUFIOPSRE-UHFFFAOYSA-N
Data  1 IC50
  Tab Delimited (TSV)   2D SDfile   Computed 3D by Vconf -m prep SDfile
Find this compound or compounds like it in BindingDB:
Activity Spreadsheet -- Enzyme Inhibition Constant Data from BindingDB
Found 1 hit for monomerid = 182064
TargetTyrosine-protein kinase SYK(Homo sapiens (Human))
Merck Sharp & Dohme
US Patent
LigandPNGBDBM182064(US9145391, 1-32)
Affinity DataIC50:  1nMpH: 7.5 T: 2°C. Assay description: A recombinant GST-hSyk fusion protein was used to measure potency of compounds to inhibit human Syk activity. The recombinant human GST-Syk (Carna Bi...
In DepthDetails US Patent