BDBM182745 US9145412, Table 1, Compound 11
SMILES COCCNc1cc2ncc(cc2cc1C1CC1)C(=O)Nc1cc(ccc1N)-c1cccs1
InChI Key InChIKey=VTVFWPAHGJYNMJ-UHFFFAOYSA-N
Data  3 IC50
  Tab Delimited (TSV)   2D SDfile   Computed 3D by Vconf -m prep SDfile
Find this compound or compounds like it in BindingDB:
Activity Spreadsheet -- Enzyme Inhibition Constant Data from BindingDB
Found 3 hits for monomerid = 182745
TargetHistone deacetylase 1(Homo sapiens (Human))
Acetylon Pharmaceuticals
US Patent
LigandPNGBDBM182745(US9145412, Table 1, Compound 11)
Affinity DataIC50:  89nMpH: 7.4Assay Description:Compounds for testing were diluted in DMSO to 50 fold the final concentration and a ten point three fold dilution series was made. The compounds were...
In DepthDetails US Patent
TargetHistone deacetylase 3(Homo sapiens (Human))
Acetylon Pharmaceuticals
US Patent
LigandPNGBDBM182745(US9145412, Table 1, Compound 11)
Affinity DataIC50:  1.55E+3nMpH: 7.4Assay Description:Compounds for testing were diluted in DMSO to 50 fold the final concentration and a ten point three fold dilution series was made. The compounds were...
In DepthDetails US Patent
TargetHistone deacetylase 2(Homo sapiens (Human))
Acetylon Pharmaceuticals
US Patent
LigandPNGBDBM182745(US9145412, Table 1, Compound 11)
Affinity DataIC50:  243nMpH: 7.4Assay Description:Compounds for testing were diluted in DMSO to 50 fold the final concentration and a ten point three fold dilution series was made. The compounds were...
In DepthDetails US Patent