BDBM182874 US9676732, 8 3-[2-Chloro-4-(2-phenylethynyl)phenyl]-8ethyl-1-methyl-quinazoline-2,4-dione
SMILES CCc1cccc2c1n(C)c(=O)n(-c1ccc(cc1Cl)C#Cc1ccccc1)c2=O
InChI Key InChIKey=KPJNQPREOODLLV-UHFFFAOYSA-N
Data  1 EC50
  Tab Delimited (TSV)   2D SDfile   Computed 3D by Vconf -m prep SDfile
Find this compound or compounds like it in BindingDB:
Activity Spreadsheet -- Enzyme Inhibition Constant Data from BindingDB
Found 1 hit for monomerid = 182874
TargetMetabotropic glutamate receptor 4(Homo sapiens (Human))
Hoffmann-La Roche
US Patent
LigandPNGBDBM182874(US9676732, 8 3-[2-Chloro-4-(2-phenylethynyl)phenyl...)
Affinity DataEC50:  65nM. Assay description: About 24 hrs before an experiment, 5×10^4 cells/well were seeded in poly-D-lysine coated, black/clear-bottomed 96-well plates. The cells were loaded ...
Ligand InfoPC cidPC sid
In DepthDetails US Patent