BDBM182876 US9676732, 10 3-[2-Chloro-4-(2-phenylethynyl)phenyl]-1-methyl-pyrido[4,3-d]pyrimidine-2,4-dione
SMILES Cn1c2ccncc2c(=O)n(-c2ccc(cc2Cl)C#Cc2ccccc2)c1=O
InChI Key InChIKey=QKZVCECVTSICEI-UHFFFAOYSA-N
Data  1 EC50
  Tab Delimited (TSV)   2D SDfile   Computed 3D by Vconf -m prep SDfile
Find this compound or compounds like it in BindingDB:
Activity Spreadsheet -- Enzyme Inhibition Constant Data from BindingDB
Found 1 hit for monomerid = 182876
TargetMetabotropic glutamate receptor 4(Homo sapiens (Human))
Hoffmann-La Roche
US Patent
LigandPNGBDBM182876(US9676732, 10 3-[2-Chloro-4-(2-phenylethynyl)pheny...)
Affinity DataEC50:  399nM. Assay description: About 24 hrs before an experiment, 5×10^4 cells/well were seeded in poly-D-lysine coated, black/clear-bottomed 96-well plates. The cells were loaded ...
Ligand InfoPC cidPC sid
In DepthDetails US Patent