BDBM182877 US9676732, 11 1-[2-Chloro-4-(2-phenylethynyl)phenyl]-3,7-dimethyl-purine-2,6-dione
SMILES Cn1cnc2n(C)c(=O)n(-c3ccc(cc3Cl)C#Cc3ccccc3)c(=O)c12
InChI Key InChIKey=MYNOYCZAIVKMAI-UHFFFAOYSA-N
Data  1 EC50
  Tab Delimited (TSV)   2D SDfile   Computed 3D by Vconf -m prep SDfile
Find this compound or compounds like it in BindingDB:
Activity Spreadsheet -- Enzyme Inhibition Constant Data from BindingDB
Found 1 hit for monomerid = 182877
TargetMetabotropic glutamate receptor 4(Homo sapiens (Human))
Hoffmann-La Roche
US Patent
LigandPNGBDBM182877(US9676732, 11 1-[2-Chloro-4-(2-phenylethynyl)pheny...)
Affinity DataEC50:  175nM. Assay description: About 24 hrs before an experiment, 5×10^4 cells/well were seeded in poly-D-lysine coated, black/clear-bottomed 96-well plates. The cells were loaded ...
Ligand InfoPC cidPC sid
In DepthDetails US Patent