BDBM182913 US9676732, 47 2-(3-Chloro-5-(phenylethynyl)pyridin-2-yl)-5,6-dihydro-1H-pyrrolo[3,2,1-ij]quinazoline-1,3(2H)-dione
SMILES Clc1cc(cnc1-n1c(=O)n2CCc3cccc(c23)c1=O)C#Cc1ccccc1
InChI Key InChIKey=YGIZBNHCAYOICQ-UHFFFAOYSA-N
Data  1 EC50
  Tab Delimited (TSV)   2D SDfile   Computed 3D by Vconf -m prep SDfile
Find this compound or compounds like it in BindingDB:
Activity Spreadsheet -- Enzyme Inhibition Constant Data from BindingDB
Found 1 hit for monomerid = 182913
TargetMetabotropic glutamate receptor 4(Homo sapiens (Human))
Hoffmann-La Roche
US Patent
LigandPNGBDBM182913(US9676732, 47 2-(3-Chloro-5-(phenylethynyl)pyridin...)
Affinity DataEC50:  187nM. Assay description: About 24 hrs before an experiment, 5×10^4 cells/well were seeded in poly-D-lysine coated, black/clear-bottomed 96-well plates. The cells were loaded ...
Ligand InfoPC cidPC sid
In DepthDetails US Patent