BDBM182918 US9676732, 52 6-[2-Chloro-4-(2-phenylethynyl)phenyl]-4-methyl-thiazolo[4,5-d]pyrimidine-5,7-dione
SMILES Cn1c2ncsc2c(=O)n(-c2ccc(cc2Cl)C#Cc2ccccc2)c1=O
InChI Key InChIKey=SXBKMHPXNKQHFN-UHFFFAOYSA-N
Data  1 EC50
  Tab Delimited (TSV)   2D SDfile   Computed 3D by Vconf -m prep SDfile
Find this compound or compounds like it in BindingDB:
Activity Spreadsheet -- Enzyme Inhibition Constant Data from BindingDB
Found 1 hit for monomerid = 182918
TargetMetabotropic glutamate receptor 4(Homo sapiens (Human))
Hoffmann-La Roche
US Patent
LigandPNGBDBM182918(US9676732, 52 6-[2-Chloro-4-(2-phenylethynyl)pheny...)
Affinity DataEC50:  200nM. Assay description: About 24 hrs before an experiment, 5×10^4 cells/well were seeded in poly-D-lysine coated, black/clear-bottomed 96-well plates. The cells were loaded ...
Ligand InfoPC cidPC sid
In DepthDetails US Patent