BDBM182948 US9670142, A10 4-imidazo[1,2-a]pyrimidin-2-yl-N-methyl-N-((1R,3S)-3-propionylamino-cyclopentyl)-benzamide
SMILES CCC(=O)N[C@H]1CC[C@H](C1)N(C)C(=O)c1ccc(cc1)-c1cn2cccnc2n1
InChI Key InChIKey=FHSZTLKFRJRNEW-ZWKOTPCHSA-N
Data  1 IC50
  Tab Delimited (TSV)   2D SDfile   Computed 3D by Vconf -m prep SDfile
Find this compound or compounds like it in BindingDB:
Activity Spreadsheet -- Enzyme Inhibition Constant Data from BindingDB
Found 1 hit for monomerid = 182948
TargetFatty acid synthase(Homo sapiens (Human))
Merck Patent
US Patent
LigandPNGBDBM182948(US9670142, A10 4-imidazo[1,2-a]pyrimidin-2-yl-N-me...)
Affinity DataIC50: <300nMpH: 7.0 T: 2°C. Assay description: The biochemical FASN activity testing was performed as 384 well two-time-point kinetic fluorescence intensity assay format in Greiner low volume medi...
Ligand InfoPC cidPC sid
In DepthDetails US Patent