BDBM182972 US9150544, 6
SMILES CN(C)c1ncc(s1)S(=O)(=O)N[C@H]1CCN([C@H](Cc2ccc3c(N)nccc3c2F)C(O)=O)C1=O
InChI Key InChIKey=QVGYEGOZKMWZDP-LSDHHAIUSA-N
Data  2 IC50
  Tab Delimited (TSV)   2D SDfile   Computed 3D by Vconf -m prep SDfile
Find this compound or compounds like it in BindingDB:
Activity Spreadsheet -- Enzyme Inhibition Constant Data from BindingDB
Found 2 hits for monomerid = 182972
TargetCoagulation factor X(Homo sapiens (Human))
Sanofi
US Patent
LigandPNGBDBM182972(US9150544, 6)
Affinity DataIC50:  200nMpH: 7.0Assay Description:The compounds according to the invention are tested in a range of concentrations (10pM to 10 µM final) in assay buffer (50 mM TRIS, 100 mM NaCl, 0.1 ...
In DepthDetails US Patent
TargetCoagulation factor IX(Homo sapiens (Human))
Sanofi
US Patent
LigandPNGBDBM182972(US9150544, 6)
Affinity DataIC50:  160nM. Assay description: The compounds according to the invention are tested in a range of concentrations (4.9 nM to 5 µM final) and deposited in a proportion of 25 µl per we...
In DepthDetails US Patent