BDBM183111 US9150546, I-254::US9688643, I-254::US9718790, I-0254
SMILES CC(C)Oc1ccc(Nc2nc(=O)n(C(C)C)c(=O)n2Cc2ccc(Cl)s2)cc1F
InChI Key InChIKey=VRGLWZSDHZCAOI-UHFFFAOYSA-N
Data  3 IC50
  Tab Delimited (TSV)   2D SDfile   Computed 3D by Vconf -m prep SDfile
Find this compound or compounds like it in BindingDB:
Activity Spreadsheet -- Enzyme Inhibition Constant Data from BindingDB
Found 3 hits for monomerid = 183111
TargetP2X purinoceptor 3(Homo sapiens (Human))
Shionogi
US Patent
LigandPNGBDBM183111(US9150546, I-254 | US9688643, I-254 | US9718790, I...)
Affinity DataIC50:  144nMpH: 7.5 T: 2°C. Assay description: Stably expressing cell line (C6BU-1 cell transfected with human P2X3 receptor gene (GenBank accession number Y07683)) was used. The cells were seeded...
Ligand InfoPC cidPC sid
In DepthDetails US Patent
TargetP2X purinoceptor 3(Homo sapiens (Human))
Shionogi
US Patent
LigandPNGBDBM183111(US9150546, I-254 | US9688643, I-254 | US9718790, I...)
Affinity DataIC50:  144nMpH: 7.5Assay Description:Stably expressing cell line (C6BU-1 transfected with human P2X3 receptor gene (GenBank accession number Y07683) was used. The cells were seeded in a ...
Ligand InfoPC cidPC sid
In DepthDetails US Patent
TargetP2X purinoceptor 3(Homo sapiens (Human))
Shionogi
US Patent
LigandPNGBDBM183111(US9150546, I-254 | US9688643, I-254 | US9718790, I...)
Affinity DataIC50:  144nM. Assay description: Stably expressing cell line (C6BU-1 cell transfected with human P2X3 receptor gene (GenBank accession number Y07683)) was used. The cells were seeded...
Ligand InfoPC cidPC sid
In DepthDetails US Patent