BDBM183572 US9670142, A72 N-methyl-N-((1R,3S)-3-propionylamino-cyclopentyl)-4-quinolin-3-yl-benzamide
SMILES CCC(=O)N[C@H]1CC[C@H](C1)N(C)C(=O)c1ccc(cc1)-c1cnc2ccccc2c1
InChI Key InChIKey=QIMQCDINZYRBTJ-FCHUYYIVSA-N
Data  1 IC50
  Tab Delimited (TSV)   2D SDfile   Computed 3D by Vconf -m prep SDfile
Find this compound or compounds like it in BindingDB:
Activity Spreadsheet -- Enzyme Inhibition Constant Data from BindingDB
Found 1 hit for monomerid = 183572
TargetFatty acid synthase(Homo sapiens (Human))
Merck Patent
US Patent
LigandPNGBDBM183572(US9670142, A72 N-methyl-N-((1R,3S)-3-propionylamin...)
Affinity DataIC50: <300nMpH: 7.0 T: 2°C. Assay description: The biochemical FASN activity testing was performed as 384 well two-time-point kinetic fluorescence intensity assay format in Greiner low volume medi...
Ligand InfoPC cidPC sid
In DepthDetails US Patent