BDBM183586 US9145354, 238
SMILES C[C@@H](CC(N)=O)N[C@H](C1CC1)c1ccc(Cl)c(C(=O)c2ccc(cn2)C#N)c1F
InChI Key InChIKey=STOXAYRHUXURNF-PRWKNARSSA-N
Data  1 IC50
  Tab Delimited (TSV)   2D SDfile   Computed 3D by Vconf -m prep SDfile
Find this compound or compounds like it in BindingDB:
Activity Spreadsheet -- Enzyme Inhibition Constant Data from BindingDB
Found 1 hit for monomerid = 183586
TargetGenome polyprotein(Hepatitis C virus (HCV genotype 1a, isolate H))
Astex Therapeutics
US Patent
LigandPNGBDBM183586(US9145354, 238)
Affinity DataIC50:  110nMT: 2°C. Assay description: The HCV NS3 protease functions have been extensively studied and are considered as potential targets for antiviral therapy: see for example the many ...
In DepthDetails US Patent