BDBM183596 US9145354, 250
SMILES CC[C@@H](NC(C)(C)CC(N)=O)c1ccc(Cl)c(C(=O)c2ccc(N)nc2)c1F
InChI Key InChIKey=AJDIHXMZZHNTAI-CQSZACIVSA-N
Data  1 IC50
  Tab Delimited (TSV)   2D SDfile   Computed 3D by Vconf -m prep SDfile
Find this compound or compounds like it in BindingDB:
Activity Spreadsheet -- Enzyme Inhibition Constant Data from BindingDB
Found 1 hit for monomerid = 183596
TargetGenome polyprotein(Hepatitis C virus (HCV genotype 1a, isolate H))
Astex Therapeutics
US Patent
LigandPNGBDBM183596(US9145354, 250)
Affinity DataIC50:  95nMT: 2°C. Assay description: The HCV NS3 protease functions have been extensively studied and are considered as potential targets for antiviral therapy: see for example the many ...
In DepthDetails US Patent