BDBM18369 N-(adamantan-1-yl)-4-[(3R,4R,5R)-3,4-dihydroxy-5-(hydroxymethyl)piperidin-1-yl]butanamide::isofagomine-based compound, 3
SMILES OC[C@H]1CN(CCCC(=O)NC23CC4CC(CC(C4)C2)C3)C[C@@H](O)[C@@H]1O
InChI Key InChIKey=SOTQIIBUGHONKZ-WEUZRQAKSA-N
Data  1 IC50
  Tab Delimited (TSV)   2D SDfile   Computed 3D by Vconf -m prep SDfile
Find this compound or compounds like it in BindingDB:
Activity Spreadsheet -- Enzyme Inhibition Constant Data from BindingDB
Found 1 hit for monomerid = 18369
TargetLysosomal acid glucosylceramidase(Homo sapiens (Human))
The Scripps Research Institute
LigandPNGBDBM18369(N-(adamantan-1-yl)-4-[(3R,4R,5R)-3,4-dihydroxy-5-(...)
Affinity DataIC50:  1.80E+4nMpH: 5.0 T: 2°C. Assay description: Enzyme activity was determined as the production of fluorescent 4-MU from the substrate. The fluorescence was measured (excitation 365 nm, emission 4...
In DepthDetails ArticlePubMed