BDBM184190 US9150577, 43
SMILES FC(F)(F)c1ccc2[nH]c(NC(=O)c3ccc4cc5C(=O)NCCCn5c4c3)nc2c1
InChI Key InChIKey=PBMNILAOXWMRQZ-UHFFFAOYSA-N
Data  1 IC50
  Tab Delimited (TSV)   2D SDfile   Computed 3D by Vconf -m prep SDfile
Find this compound or compounds like it in BindingDB:
Activity Spreadsheet -- Enzyme Inhibition Constant Data from BindingDB
Found 1 hit for monomerid = 184190
TargetRibosomal protein S6 kinase alpha-2(Homo sapiens (Human))
Boehringer Ingelheim International
US Patent
LigandPNGBDBM184190(US9150577, 43)
Affinity DataIC50:  24nMpH: 7.5Assay Description:Human RSK2 protein, purchased from Invitrogen, is used to measure kinase activity utilizing Kinase Glo Plus (Promega) a homogeneous assay technology,...
In DepthDetails US Patent