BDBM184193 US9150577, 46
SMILES Clc1cc(CN2CCOCC2)c2[nH]c(NC(=O)c3ccc4cc5C(=O)NCCCn5c4c3)nc2c1
InChI Key InChIKey=YPTNAEQZLHASCB-UHFFFAOYSA-N
Data  1 IC50
  Tab Delimited (TSV)   2D SDfile   Computed 3D by Vconf -m prep SDfile
Find this compound or compounds like it in BindingDB:
Activity Spreadsheet -- Enzyme Inhibition Constant Data from BindingDB
Found 1 hit for monomerid = 184193
TargetRibosomal protein S6 kinase alpha-2(Homo sapiens (Human))
Boehringer Ingelheim International
US Patent
LigandPNGBDBM184193(US9150577, 46)
Affinity DataIC50:  8.70nMpH: 7.5Assay Description:Human RSK2 protein, purchased from Invitrogen, is used to measure kinase activity utilizing Kinase Glo Plus (Promega) a homogeneous assay technology,...
In DepthDetails US Patent