BDBM184263 US9150577, 133
SMILES C[C@H]1CNC(=O)c2cc3ccc(cc3n12)C(=O)Nc1cnn(Cc2ccccc2)c1
InChI Key InChIKey=KNOWVQTVZVKLHZ-HNNXBMFYSA-N
Data  1 IC50
  Tab Delimited (TSV)   2D SDfile   Computed 3D by Vconf -m prep SDfile
Find this compound or compounds like it in BindingDB:
Activity Spreadsheet -- Enzyme Inhibition Constant Data from BindingDB
Found 1 hit for monomerid = 184263
TargetRibosomal protein S6 kinase alpha-2(Homo sapiens (Human))
Boehringer Ingelheim International
US Patent
LigandPNGBDBM184263(US9150577, 133)
Affinity DataIC50:  17.5nMpH: 7.5Assay Description:Human RSK2 protein, purchased from Invitrogen, is used to measure kinase activity utilizing Kinase Glo Plus (Promega) a homogeneous assay technology,...
In DepthDetails US Patent